nebula-algorithm 2.0.1 打包出错 net.alchim31.maven:scala-maven-plugin

nebula 版本:2.0.1

部署方式(分布式 / 单机 / Docker / DBaaS):单机
磁盘( 推荐使用 SSD):346G
CPU、内存信息:12核,128G
问题的具体描述
我尝试按照https://docs.nebula-graph.com.cn/2.0.1/nebula-algorithm/中的流程安装算法。
在执行打包的时候出现了这个错误。

[ERROR] Error resolving version for plugin 'net.alchim31.maven:scala-maven-plugin' from the repositories [local (C:\Users\taozi\.m2\repository), snapshots (http://192.168.10.222:8081/nexus/content/repositories/snapshots), nexus (http
://192.168.10.222:8081/nexus/content/groups/public)]: Plugin not found in any plugin repository -> [Help 1]
[ERROR]
[ERROR] To see the full stack trace of the errors, re-run Maven with the -e switch.
[ERROR] Re-run Maven using the -X switch to enable full debug logging.
[ERROR]
[ERROR] For more information about the errors and possible solutions, please read the following articles:
[ERROR] [Help 1] http://cwiki.apache.org/confluence/display/MAVEN/PluginVersionResolutionException

maven版本多少? 错误提示你本地仓库找不到对应的plugin包

apache-maven-3.6.3
默认的settings.xml

[INFO]
[INFO] --------------------< com.vesoft:nebula-algorithm >---------------------
[INFO] Building nebula-algorithm 2.0-SNAPSHOT
[INFO] --------------------------------[ jar ]---------------------------------
Downloading from nexus: http://192.168.10.222:8081/nexus/content/groups/public/org/scala-tools/maven-scala-plugin/2.15.2/maven-scala-plugin-2.15.2.pom
[INFO] ------------------------------------------------------------------------
[INFO] BUILD FAILURE
[INFO] ------------------------------------------------------------------------
[INFO] Total time: 21.669 s
[INFO] Finished at: 2021-08-13T18:57:48+08:00
[INFO] ------------------------------------------------------------------------
[ERROR] Plugin org.scala-tools:maven-scala-plugin:2.15.2 or one of its dependencies could not be resolved: Failed to read artifact descriptor for org.scala-tools:maven-scala-plugin:jar:2.15.2: Could not transfer artifact org.scala-t
ools:maven-scala-plugin:pom:2.15.2 from/to nexus (http://192.168.10.222:8081/nexus/content/groups/public): Transfer failed for http://192.168.10.222:8081/nexus/content/groups/public/org/scala-tools/maven-scala-plugin/2.15.2/maven-sc
ala-plugin-2.15.2.pom: Connect to 192.168.10.222:8081 [/192.168.10.222] failed: Connection timed out: connect → [Help 1]
[ERROR]
[ERROR] To see the full stack trace of the errors, re-run Maven with the -e switch.
[ERROR] Re-run Maven using the -X switch to enable full debug logging.
[ERROR]
[ERROR] For more information about the errors and possible solutions, please read the following articles:
[ERROR] [Help 1] http://cwiki.apache.org/confluence/display/MAVEN/PluginResolutionException

手动下载这个依赖试下

此话题已在最后回复的 30 天后被自动关闭。不再允许新回复。